{"text_format":"1","workbook":"xlsx","n_sheets":2,"sheets":["Kalkulator","BAZA_LIBOR_WIBOR_KURS"],"not_rendered":{"charts":1,"images":0,"macros":0,"external_links":0,"defined_names":1,"comments":0,"pivot_tables":0},"unopened":[],"bounds":{"document_bytes":16777216,"sheet_cells":100000,"rows_first":2000,"rows_last":500,"rows_between":2000,"halvings":0,"cell_chars":16384,"cell_head_chars":4096},"cells_cut":0,"cells_raw":0,"read":"whole","date_system":"1900"}

{"sheet":"Kalkulator","index":0,"n_rows":490,"n_cols":14,"rows_kept":490,"cut":false,"hidden":false,"merged":[]}
[null,"Uruchomienie kredytu",null,null,"Stan aktualny",null,null,"Saldo kapitału w PLN"]
[null,"Kwota kredytu PLN",300000,null,"Rok",2015,null,"Kurs otwarcia"]
[null,"Okres kredytowania ",360,null,"Miesiąc","grudzień",null,{"$f":"F7*C7","v":236047.01265382211},{"$f":"H3/F7","v":2.2740318181818187}]
[null,"Rok",2007,null,"Data",{"$f":"DATE(F2,VLOOKUP(F3,BAZA_LIBOR_WIBOR_KURS!I2:J13,2,FALSE),1)","v":"2015-12-01"},null,"Kalkulator"]
[null,"Miesiąc","lipiec",null,"Saldo kapitału PLN",{"$f":"VLOOKUP(F4,B11:N490,13,FALSE)","v":290959.93570846762},null,{"$f":"F5","v":290959.93570846762},{"$f":"H5/F7","v":2.8030524266263286}]
[null,"Data uruchomienia",{"$f":"DATE(C4,VLOOKUP(C5,BAZA_LIBOR_WIBOR_KURS!I2:J13,2,FALSE),1)","v":"2007-07-01"},null,"Kurs CHF",{"$f":"VLOOKUP(F4,BAZA_LIBOR_WIBOR_KURS!C2:F145,4,FALSE)","v":3.9140000000000001},null,"Kurs aktualny"]
[null,"Kurs CHF",{"$f":"VLOOKUP(C6,BAZA_LIBOR_WIBOR_KURS!C2:F145,4,FALSE)","v":2.2740318181818187},null,"Saldo kapitału CHF",{"$f":"VLOOKUP(F4,B11:G490,6,FALSE)","v":103801.10373413831},null,{"$f":"F7*F6","v":406277.52001541737},{"$f":"H7/F7","v":3.9140000000000006}]
[null,"Kwota kredytu CHF",{"$f":"ROUND(C2/C7,2)","v":131924.28}]
[]
["Nr raty","Data","LIBOR_3M_CHF","Marża","odsetki_CHF","kapitał_CHF","Saldo kapitału_CHF","kurs_CHF","WIBOR_3M","Marża","Wpłata w PLN","Odsetki_PLN","Kapitał_PLN","Saldo kapitału_PLN"]
[1,{"$f":"DATE(C4,VLOOKUP(C5,BAZA_LIBOR_WIBOR_KURS!I2:J13,2,FALSE)+1,1)","v":"2007-08-01"},{"$f":"VLOOKUP(B11,BAZA_LIBOR_WIBOR_KURS!$C$2:$F$145,2,FALSE)","v":2.7959999999999999E-2},0.02,{"$f":"IPMT((C11+D11)/12,1,$C$3,-C8)","v":527.25737240000001},{"$f":"PPMT((C11+D11)/12,1,$C$3,-C8)","v":164.58468774652502},{"$f":"$C$8-SUM($F$11:F11)","v":131759.69531225346},{"$f":"VLOOKUP(B11,BAZA_LIBOR_WIBOR_KURS!$C$2:$F$145,4,FALSE)","v":2.3273727272727274},{"$f":"VLOOKUP(B11,BAZA_LIBOR_WIBOR_KURS!$C$2:$F$145,3,FALSE)","v":4.9086363636363629E-2},0.02,{"$f":"IF(A11>$C$3,\"_\",IF(B11>$F$4,0,H11*(E11+F11)))","v":1610.1743423652001},{"$f":"ROUND(C2*(I11+J11)/12,2)","v":1727.16},{"$f":"IFERROR(K11-L11,\"_\")","v":-116.98565763479996},{"$f":"IF(A11>$C$3,\"_\",$C$2-SUM($M$11:M11))","v":300116.9856576348}]
[{"$f":"A11+1","v":2},{"$f":"IF(A12>$C$3,\"_\",DATE(YEAR(B11),MONTH(B11)+1,1))","v":"2007-09-01"},{"$f":"IF(A12>$C$3,\"_\",IFERROR(VLOOKUP(B12,BAZA_LIBOR_WIBOR_KURS!$C$2:$F$145,2,FALSE),C11))","v":2.8240000000000001E-2},{"$f":"IF(A12>$C$3,\"_\",D11)","v":0.02},{"$f":"IF(A12>$C$3,\"_\",IPMT((C12+D12)/12,1,$C$3-A11,-G11))","v":529.67397515525897},{"$f":"IF(A12>$C$3,\"_\",PPMT((C12+D12)/12,1,$C$3-A11,-G11))","v":164.39765309837972},{"$f":"IF(A12>$C$3,\"_\",$C$8-SUM($F$11:F12))","v":131595.2976591551},{"$f":"IF(A12>$C$3,\"_\",IFERROR(VLOOKUP(B12,BAZA_LIBOR_WIBOR_KURS!$C$2:$F$145,4,FALSE),H11))","v":2.2997249999999996},{"$f":"IF(A12>$C$3,\"_\",IFERROR(VLOOKUP(B12,BAZA_LIBOR_WIBOR_KURS!$C$2:$F$145,3,FALSE),I11))","v":5.0909999999999997E-2},{"$f":"IF(A12>$C$3,\"_\",J11)","v":0.02},1596.1738752855988,{"$f":"IF(A12>$C$3,\"_\",IF(N11<0,0,ROUND(N11*(I12+J12)/12,2)))","v":1773.44},{"$f":"IFERROR(K12-L12,\"_\")","v":-177.26612471440126},{"$f":"IF(A12>$C$3,\"_\",$C$2-SUM($M$11:M12))","v":300294.25178234919}]
[{"$f":"A12+1","v":3},"2007-10-01",{"$f":"IF(A13>$C$3,\"_\",IFERROR(VLOOKUP(B13,BAZA_LIBOR_WIBOR_KURS!$C$2:$F$145,2,FALSE),C12))","v":2.7869999999999999E-2},0.02,524.95557491197951,166.17644597175953,{"$f":"IF(A13>$C$3,\"_\",$C$8-SUM($F$11:F13))","v":131429.12121318333},{"$f":"IF(A13>$C$3,\"_\",IFERROR(VLOOKUP(B13,BAZA_LIBOR_WIBOR_KURS!$C$2:$F$145,4,FALSE),H12))","v":2.2189869565217393},{"$f":"IF(A13>$C$3,\"_\",IFERROR(VLOOKUP(B13,BAZA_LIBOR_WIBOR_KURS!$C$2:$F$145,3,FALSE),I12))","v":5.128695652173914E-2},0.02,1533.6129395755272,1783.92,-250.30706042447287,{"$f":"IF(A13>$C$3,\"_\",$C$2-SUM($M$11:M13))","v":300544.55884277367}]
[4,"2007-11-01",{"$f":"IF(A14>$C$3,\"_\",IFERROR(VLOOKUP(B14,BAZA_LIBOR_WIBOR_KURS!$C$2:$F$145,2,FALSE),C13))","v":2.751E-2},0.02,520.34979573652834,167.93362814372713,{"$f":"IF(A14>$C$3,\"_\",$C$8-SUM($F$11:F14))","v":131261.18758503962},{"$f":"IF(A14>$C$3,\"_\",IFERROR(VLOOKUP(B14,BAZA_LIBOR_WIBOR_KURS!$C$2:$F$145,4,FALSE),H13))","v":2.2200523809523811},{"$f":"IF(A14>$C$3,\"_\",IFERROR(VLOOKUP(B14,BAZA_LIBOR_WIBOR_KURS!$C$2:$F$145,3,FALSE),I13))","v":5.3638095238095228E-2},0.02,1528.0252539554181,1844.29,-316.2647460445819,{"$f":"IF(A14>$C$3,\"_\",$C$2-SUM($M$11:M14))","v":300860.82358881825}]
[5,"2007-12-01",{"$f":"IF(A15>$C$3,\"_\",IFERROR(VLOOKUP(B15,BAZA_LIBOR_WIBOR_KURS!$C$2:$F$145,2,FALSE),C14))","v":2.7740000000000001E-2},0.02,522.20075794248271,167.89826104413598,{"$f":"IF(A15>$C$3,\"_\",$C$8-SUM($F$11:F15))","v":131093.28932399547},{"$f":"IF(A15>$C$3,\"_\",IFERROR(VLOOKUP(B15,BAZA_LIBOR_WIBOR_KURS!$C$2:$F$145,4,FALSE),H14))","v":2.1712894736842108},{"$f":"IF(A15>$C$3,\"_\",IFERROR(VLOOKUP(B15,BAZA_LIBOR_WIBOR_KURS!$C$2:$F$145,3,FALSE),I14))","v":5.666842105263159E-2},0.02,1498.4047357254456,1922.21,-423.80526427455447,{"$f":"IF(A15>$C$3,\"_\",$C$2-SUM($M$11:M15))","v":301284.62885309278}]
[6,"2008-01-01",{"$f":"IF(A16>$C$3,\"_\",IFERROR(VLOOKUP(B16,BAZA_LIBOR_WIBOR_KURS!$C$2:$F$145,2,FALSE),C15))","v":2.6960000000000001E-2},0.02,513.01173888790231,170.95198857380217,{"$f":"IF(A16>$C$3,\"_\",$C$8-SUM($F$11:F16))","v":130922.33733542167},{"$f":"IF(A16>$C$3,\"_\",IFERROR(VLOOKUP(B16,BAZA_LIBOR_WIBOR_KURS!$C$2:$F$145,4,FALSE),H15))","v":2.2278000000000002},{"$f":"IF(A16>$C$3,\"_\",IFERROR(VLOOKUP(B16,BAZA_LIBOR_WIBOR_KURS!$C$2:$F$145,3,FALSE),I15))","v":5.6427272727272722E-2},0.02,1523.7343920391854,1918.86,-395.12560796081448,{"$f":"IF(A16>$C$3,\"_\",$C$2-SUM($M$11:M16))","v":301679.75446105364}]
[7,"2008-02-01",{"$f":"IF(A17>$C$3,\"_\",IFERROR(VLOOKUP(B17,BAZA_LIBOR_WIBOR_KURS!$C$2:$F$145,2,FALSE),C16))","v":2.7449999999999999E-2},0.02,517.68874221381316,170.11817734643529,{"$f":"IF(A17>$C$3,\"_\",$C$8-SUM($F$11:F17))","v":130752.21915807524},{"$f":"IF(A17>$C$3,\"_\",IFERROR(VLOOKUP(B17,BAZA_LIBOR_WIBOR_KURS!$C$2:$F$145,4,FALSE),H16))","v":2.224019047619048},{"$f":"IF(A17>$C$3,\"_\",IFERROR(VLOOKUP(B17,BAZA_LIBOR_WIBOR_KURS!$C$2:$F$145,3,FALSE),I16))","v":5.7428571428571419E-2},0.02,1529.6956901861747,1946.55,-416.85430981382524,{"$f":"IF(A17>$C$3,\"_\",$C$2-SUM($M$11:M17))","v":302096.60877086746}]
[8,"2008-03-01",{"$f":"IF(A18>$C$3,\"_\",IFERROR(VLOOKUP(B18,BAZA_LIBOR_WIBOR_KURS!$C$2:$F$145,2,FALSE),C17))","v":2.8289999999999999E-2},0.02,526.16872192862104,168.23754441932488,{"$f":"IF(A18>$C$3,\"_\",$C$8-SUM($F$11:F18))","v":130583.98161365591},{"$f":"IF(A18>$C$3,\"_\",IFERROR(VLOOKUP(B18,BAZA_LIBOR_WIBOR_KURS!$C$2:$F$145,4,FALSE),H17))","v":2.2520199999999999},{"$f":"IF(A18>$C$3,\"_\",IFERROR(VLOOKUP(B18,BAZA_LIBOR_WIBOR_KURS!$C$2:$F$145,3,FALSE),I17))","v":6.0264999999999999E-2},0.02,1563.8167999409011,2020.65,-456.833200059099,{"$f":"IF(A18>$C$3,\"_\",$C$2-SUM($M$11:M18))","v":302553.44197092653}]
[9,"2008-04-01",{"$f":"IF(A19>$C$3,\"_\",IFERROR(VLOOKUP(B19,BAZA_LIBOR_WIBOR_KURS!$C$2:$F$145,2,FALSE),C18))","v":2.8479999999999998E-2},0.02,527.55928571916979,168.34090815584042,{"$f":"IF(A19>$C$3,\"_\",$C$8-SUM($F$11:F19))","v":130415.64070550007},{"$f":"IF(A19>$C$3,\"_\",IFERROR(VLOOKUP(B19,BAZA_LIBOR_WIBOR_KURS!$C$2:$F$145,4,FALSE),H18))","v":2.1591818181818176},{"$f":"IF(A19>$C$3,\"_\",IFERROR(VLOOKUP(B19,BAZA_LIBOR_WIBOR_KURS!$C$2:$F$145,3,FALSE),I18))","v":6.2913636363636324E-2},0.02,1502.5750458841239,2090.48,-587.90495411587608,{"$f":"IF(A19>$C$3,\"_\",$C$2-SUM($M$11:M19))","v":303141.34692504245}]
[10,"2008-05-01",{"$f":"IF(A20>$C$3,\"_\",IFERROR(VLOOKUP(B20,BAZA_LIBOR_WIBOR_KURS!$C$2:$F$145,2,FALSE),C19))","v":2.7820000000000001E-2},0.02,519.70632821141783,171.02176890266628,{"$f":"IF(A20>$C$3,\"_\",$C$8-SUM($F$11:F20))","v":130244.6189365974},{"$f":"IF(A20>$C$3,\"_\",IFERROR(VLOOKUP(B20,BAZA_LIBOR_WIBOR_KURS!$C$2:$F$145,4,FALSE),H19))","v":2.0952299999999999},{"$f":"IF(A20>$C$3,\"_\",IFERROR(VLOOKUP(B20,BAZA_LIBOR_WIBOR_KURS!$C$2:$F$145,3,FALSE),I19))","v":6.4145000000000008E-2},0.02,1447.2342309163423,2125.65,-678.41576908365778,{"$f":"IF(A20>$C$3,\"_\",$C$2-SUM($M$11:M20))","v":303819.76269412611}]
[11,"2008-06-01",{"$f":"IF(A21>$C$3,\"_\",IFERROR(VLOOKUP(B21,BAZA_LIBOR_WIBOR_KURS!$C$2:$F$145,2,FALSE),C20))","v":2.8369999999999999E-2},0.02,524.99435149693466,170.03361055421843,{"$f":"IF(A21>$C$3,\"_\",$C$8-SUM($F$11:F21))","v":130074.58532604319},{"$f":"IF(A21>$C$3,\"_\",IFERROR(VLOOKUP(B21,BAZA_LIBOR_WIBOR_KURS!$C$2:$F$145,4,FALSE),H20))","v":2.0907904761904765},{"$f":"IF(A21>$C$3,\"_\",IFERROR(VLOOKUP(B21,BAZA_LIBOR_WIBOR_KURS!$C$2:$F$145,3,FALSE),I20))","v":6.5757142857142847E-2},0.02,1453.1578437426267,2171.23,-718.07215625737331,{"$f":"IF(A21>$C$3,\"_\",$C$2-SUM($M$11:M21))","v":304537.83485038346}]
[12,"2008-07-01",{"$f":"IF(A22>$C$3,\"_\",IFERROR(VLOOKUP(B22,BAZA_LIBOR_WIBOR_KURS!$C$2:$F$145,2,FALSE),C21))","v":2.7859999999999999E-2},0.02,518.78080447536888,172.26779157307226,{"$f":"IF(A22>$C$3,\"_\",$C$8-SUM($F$11:F22))","v":129902.31753447012},{"$f":"IF(A22>$C$3,\"_\",IFERROR(VLOOKUP(B22,BAZA_LIBOR_WIBOR_KURS!$C$2:$F$145,4,FALSE),H21))","v":2.0148739130434783},{"$f":"IF(A22>$C$3,\"_\",IFERROR(VLOOKUP(B22,BAZA_LIBOR_WIBOR_KURS!$C$2:$F$145,3,FALSE),I21))","v":6.6200000000000023E-2},0.02,1392.3757888233245,2187.6,-795.22421117667545,{"$f":"IF(A22>$C$3,\"_\",$C$2-SUM($M$11:M22))","v":305333.05906156014}]
[13,"2008-08-01",{"$f":"IF(A23>$C$3,\"_\",IFERROR(VLOOKUP(B23,BAZA_LIBOR_WIBOR_KURS!$C$2:$F$145,2,FALSE),C22))","v":2.7480000000000001E-2},0.02,513.98016971138679,174.1168644823596,{"$f":"IF(A23>$C$3,\"_\",$C$8-SUM($F$11:F23))","v":129728.20066998775},{"$f":"IF(A23>$C$3,\"_\",IFERROR(VLOOKUP(B23,BAZA_LIBOR_WIBOR_KURS!$C$2:$F$145,4,FALSE),H22))","v":2.027765},{"$f":"IF(A23>$C$3,\"_\",IFERROR(VLOOKUP(B23,BAZA_LIBOR_WIBOR_KURS!$C$2:$F$145,3,FALSE),I22))","v":6.5210000000000004E-2},0.02,1395.2990825418822,2168.12,-772.82091745811772,{"$f":"IF(A23>$C$3,\"_\",$C$2-SUM($M$11:M23))","v":306105.87997901824}]
[14,"2008-09-01",{"$f":"IF(A24>$C$3,\"_\",IFERROR(VLOOKUP(B24,BAZA_LIBOR_WIBOR_KURS!$C$2:$F$145,2,FALSE),C23))","v":2.7789999999999999E-2},0.02,516.64255916822617,173.85681205209039,{"$f":"IF(A24>$C$3,\"_\",$C$8-SUM($F$11:F24))","v":129554.34385793566},{"$f":"IF(A24>$C$3,\"_\",IFERROR(VLOOKUP(B24,BAZA_LIBOR_WIBOR_KURS!$C$2:$F$145,4,FALSE),H23))","v":2.1158181818181823},{"$f":"IF(A24>$C$3,\"_\",IFERROR(VLOOKUP(B24,BAZA_LIBOR_WIBOR_KURS!$C$2:$F$145,3,FALSE),I23))","v":6.5581818181818199E-2},0.02,1460.9711241619682,2183.09,-722.11887583803195,{"$f":"IF(A24>$C$3,\"_\",$C$2-SUM($M$11:M24))","v":306827.9988548563}]
[15,"2008-10-01",{"$f":"IF(A25>$C$3,\"_\",IFERROR(VLOOKUP(B25,BAZA_LIBOR_WIBOR_KURS!$C$2:$F$145,2,FALSE),C24))","v":2.998E-2},0.02,539.59384216830199,167.95793761373261,{"$f":"IF(A25>$C$3,\"_\",$C$8-SUM($F$11:F25))","v":129386.38592032193},{"$f":"IF(A25>$C$3,\"_\",IFERROR(VLOOKUP(B25,BAZA_LIBOR_WIBOR_KURS!$C$2:$F$145,4,FALSE),H24))","v":2.3559260869565213},{"$f":"IF(A25>$C$3,\"_\",IFERROR(VLOOKUP(B25,BAZA_LIBOR_WIBOR_KURS!$C$2:$F$145,3,FALSE),I24))","v":6.7969565217391323E-2},0.02,1666.9396958610109,2249.29,-582.35030413898903,{"$f":"IF(A25>$C$3,\"_\",$C$2-SUM($M$11:M25))","v":307410.34915899526}]
[16,"2008-11-01",{"$f":"IF(A26>$C$3,\"_\",IFERROR(VLOOKUP(B26,BAZA_LIBOR_WIBOR_KURS!$C$2:$F$145,2,FALSE),C25))","v":1.967E-2},0.02,427.7298274549309,201.522447461208,{"$f":"IF(A26>$C$3,\"_\",$C$8-SUM($F$11:F26))","v":129184.86347286071},{"$f":"IF(A26>$C$3,\"_\",IFERROR(VLOOKUP(B26,BAZA_LIBOR_WIBOR_KURS!$C$2:$F$145,4,FALSE),H25))","v":2.4589999999999996},{"$f":"IF(A26>$C$3,\"_\",IFERROR(VLOOKUP(B26,BAZA_LIBOR_WIBOR_KURS!$C$2:$F$145,3,FALSE),I25))","v":6.7394736842105257E-2},0.02,1547.3313440187856,2238.84,-691.50865598121459,{"$f":"IF(A26>$C$3,\"_\",$C$2-SUM($M$11:M26))","v":308101.85781497648}]
[17,"2008-12-01",{"$f":"IF(A27>$C$3,\"_\",IFERROR(VLOOKUP(B27,BAZA_LIBOR_WIBOR_KURS!$C$2:$F$145,2,FALSE),C26))","v":9.1299999999999992E-3},0.02,313.59625608036936,240.74249667437687,{"$f":"IF(A27>$C$3,\"_\",$C$8-SUM($F$11:F27))","v":128944.12097618634},{"$f":"IF(A27>$C$3,\"_\",IFERROR(VLOOKUP(B27,BAZA_LIBOR_WIBOR_KURS!$C$2:$F$145,4,FALSE),H26))","v":2.6059285714285716},{"$f":"IF(A27>$C$3,\"_\",IFERROR(VLOOKUP(B27,BAZA_LIBOR_WIBOR_KURS!$C$2:$F$145,3,FALSE),I26))","v":6.3785714285714265E-2},0.02,1444.567194053672,2151.21,-706.64280594632805,{"$f":"IF(A27>$C$3,\"_\",$C$2-SUM($M$11:M27))","v":308808.50062092283}]
[18,"2009-01-01",{"$f":"IF(A28>$C$3,\"_\",IFERROR(VLOOKUP(B28,BAZA_LIBOR_WIBOR_KURS!$C$2:$F$145,2,FALSE),C27))","v":5.6899999999999997E-3},0.02,276.04787232318563,255.03320748348008,{"$f":"IF(A28>$C$3,\"_\",$C$8-SUM($F$11:F28))","v":128689.08776870287},{"$f":"IF(A28>$C$3,\"_\",IFERROR(VLOOKUP(B28,BAZA_LIBOR_WIBOR_KURS!$C$2:$F$145,4,FALSE),H27))","v":2.8255238095238098},{"$f":"IF(A28>$C$3,\"_\",IFERROR(VLOOKUP(B28,BAZA_LIBOR_WIBOR_KURS!$C$2:$F$145,3,FALSE),I27))","v":5.5061904761904756E-2},0.02,1500.5822357813486,1931.65,-431.06776421865152,{"$f":"IF(A28>$C$3,\"_\",$C$2-SUM($M$11:M28))","v":309239.56838514144}]
[19,"2009-02-01",{"$f":"IF(A29>$C$3,\"_\",IFERROR(VLOOKUP(B29,BAZA_LIBOR_WIBOR_KURS!$C$2:$F$145,2,FALSE),C28))","v":5.0600000000000003E-3},0.02,268.74571162364111,258.14825116399896,{"$f":"IF(A29>$C$3,\"_\",$C$8-SUM($F$11:F29))","v":128430.93951753886},{"$f":"IF(A29>$C$3,\"_\",IFERROR(VLOOKUP(B29,BAZA_LIBOR_WIBOR_KURS!$C$2:$F$145,4,FALSE),H28))","v":3.1191750000000003},{"$f":"IF(A29>$C$3,\"_\",IFERROR(VLOOKUP(B29,BAZA_LIBOR_WIBOR_KURS!$C$2:$F$145,3,FALSE),I28))","v":4.6875000000000014E-2},0.02,1643.4744763781373,1723.37,-79.895523621862594,{"$f":"IF(A29>$C$3,\"_\",$C$2-SUM($M$11:M29))","v":309319.46390876331}]
[20,"2009-03-01",{"$f":"IF(A30>$C$3,\"_\",IFERROR(VLOOKUP(B30,BAZA_LIBOR_WIBOR_KURS!$C$2:$F$145,2,FALSE),C29))","v":4.3600000000000002E-3},0.02,260.71480722060392,261.56097526549388,{"$f":"IF(A30>$C$3,\"_\",$C$8-SUM($F$11:F30))","v":128169.37854227338},{"$f":"IF(A30>$C$3,\"_\",IFERROR(VLOOKUP(B30,BAZA_LIBOR_WIBOR_KURS!$C$2:$F$145,4,FALSE),H29))","v":3.0715227272727272},{"$f":"IF(A30>$C$3,\"_\",IFERROR(VLOOKUP(B30,BAZA_LIBOR_WIBOR_KURS!$C$2:$F$145,3,FALSE),I29))","v":4.2990909090909087E-2},0.02,1604.1819358101968,1623.69,-19.508064189803235,{"$f":"IF(A30>$C$3,\"_\",$C$2-SUM($M$11:M30))","v":309338.97197295312}]
[21,"2009-04-01",{"$f":"IF(A31>$C$3,\"_\",IFERROR(VLOOKUP(B31,BAZA_LIBOR_WIBOR_KURS!$C$2:$F$145,2,FALSE),C30))","v":4.0099999999999997E-3},0.02,256.44556489999866,263.53584225869491,{"$f":"IF(A31>$C$3,\"_\",$C$8-SUM($F$11:F31))","v":127905.84270001468},{"$f":"IF(A31>$C$3,\"_\",IFERROR(VLOOKUP(B31,BAZA_LIBOR_WIBOR_KURS!$C$2:$F$145,4,FALSE),H30))","v":2.9235857142857142},{"$f":"IF(A31>$C$3,\"_\",IFERROR(VLOOKUP(B31,BAZA_LIBOR_WIBOR_KURS!$C$2:$F$145,3,FALSE),I30))","v":4.2047619047619049E-2},0.02,1520.21021366334,1599.48,-79.26978633665999,{"$f":"IF(A31>$C$3,\"_\",$C$2-SUM($M$11:M31))","v":309418.24175928981}]
[22,"2009-05-01",{"$f":"IF(A32>$C$3,\"_\",IFERROR(VLOOKUP(B32,BAZA_LIBOR_WIBOR_KURS!$C$2:$F$145,2,FALSE),C31))","v":4.0200000000000001E-3},0.02,256.02486180452939,264.02184926453424,{"$f":"IF(A32>$C$3,\"_\",$C$8-SUM($F$11:F32))","v":127641.82085075014},{"$f":"IF(A32>$C$3,\"_\",IFERROR(VLOOKUP(B32,BAZA_LIBOR_WIBOR_KURS!$C$2:$F$145,4,FALSE),H31))","v":2.9161999999999995},{"$f":"IF(A32>$C$3,\"_\",IFERROR(VLOOKUP(B32,BAZA_LIBOR_WIBOR_KURS!$C$2:$F$145,3,FALSE),I31))","v":4.5155000000000001E-2},0.02,1516.5602188196028,1680.01,-163.44978118039717,{"$f":"IF(A32>$C$3,\"_\",$C$2-SUM($M$11:M32))","v":309581.69154047017}]
[23,"2009-06-01",{"$f":"IF(A33>$C$3,\"_\",IFERROR(VLOOKUP(B33,BAZA_LIBOR_WIBOR_KURS!$C$2:$F$145,2,FALSE),C32))","v":3.9500000000000004E-3},0.02,254.75180078128884,264.83906009789985,{"$f":"IF(A33>$C$3,\"_\",$C$8-SUM($F$11:F33))","v":127376.98179065224},{"$f":"IF(A33>$C$3,\"_\",IFERROR(VLOOKUP(B33,BAZA_LIBOR_WIBOR_KURS!$C$2:$F$145,4,FALSE),H32))","v":2.9769428571428569},{"$f":"IF(A33>$C$3,\"_\",IFERROR(VLOOKUP(B33,BAZA_LIBOR_WIBOR_KURS!$C$2:$F$145,3,FALSE),I32))","v":4.5980952380952379E-2},0.02,1546.7923019310085,1702.21,-155.41769806899151,{"$f":"IF(A33>$C$3,\"_\",$C$2-SUM($M$11:M33))","v":309737.10923853918}]
[24,"2009-07-01",{"$f":"IF(A34>$C$3,\"_\",IFERROR(VLOOKUP(B34,BAZA_LIBOR_WIBOR_KURS!$C$2:$F$145,2,FALSE),C33))","v":3.7299999999999998E-3},0.02,251.88798149101481,266.27542311051064,{"$f":"IF(A34>$C$3,\"_\",$C$8-SUM($F$11:F34))","v":127110.70636754173},{"$f":"IF(A34>$C$3,\"_\",IFERROR(VLOOKUP(B34,BAZA_LIBOR_WIBOR_KURS!$C$2:$F$145,4,FALSE),H33))","v":2.8288478260869567},{"$f":"IF(A34>$C$3,\"_\",IFERROR(VLOOKUP(B34,BAZA_LIBOR_WIBOR_KURS!$C$2:$F$145,3,FALSE),I33))","v":4.2582608695652162E-2},0.02,1465.8054206648414,1615.35,-149.54457933515846,{"$f":"IF(A34>$C$3,\"_\",$C$2-SUM($M$11:M34))","v":309886.65381787432}]
[25,"2009-08-01",{"$f":"IF(A35>$C$3,\"_\",IFERROR(VLOOKUP(B35,BAZA_LIBOR_WIBOR_KURS!$C$2:$F$145,2,FALSE),C34))","v":3.4299999999999999E-3},0.02,248.18365418262522,268.04195882609889,{"$f":"IF(A35>$C$3,\"_\",$C$8-SUM($F$11:F35))","v":126842.66440871563},{"$f":"IF(A35>$C$3,\"_\",IFERROR(VLOOKUP(B35,BAZA_LIBOR_WIBOR_KURS!$C$2:$F$145,4,FALSE),H34))","v":2.7103809523809521},{"$f":"IF(A35>$C$3,\"_\",IFERROR(VLOOKUP(B35,BAZA_LIBOR_WIBOR_KURS!$C$2:$F$145,3,FALSE),I34))","v":4.1590476190476171E-2},0.02,1399.1680686300267,1590.51,-191.34193136997328,{"$f":"IF(A35>$C$3,\"_\",$C$2-SUM($M$11:M35))","v":310077.99574924429}]
[26,"2009-09-01",{"$f":"IF(A36>$C$3,\"_\",IFERROR(VLOOKUP(B36,BAZA_LIBOR_WIBOR_KURS!$C$2:$F$145,2,FALSE),C35))","v":3.0100000000000001E-3},0.02,243.22080900371219,270.30609399033671,{"$f":"IF(A36>$C$3,\"_\",$C$8-SUM($F$11:F36))","v":126572.35831472529},{"$f":"IF(A36>$C$3,\"_\",IFERROR(VLOOKUP(B36,BAZA_LIBOR_WIBOR_KURS!$C$2:$F$145,4,FALSE),H35))","v":2.7480090909090906},{"$f":"IF(A36>$C$3,\"_\",IFERROR(VLOOKUP(B36,BAZA_LIBOR_WIBOR_KURS!$C$2:$F$145,3,FALSE),I35))","v":4.1772727272727253E-2},0.02,1411.176597854037,1596.2,-185.02340214596302,{"$f":"IF(A36>$C$3,\"_\",$C$2-SUM($M$11:M36))","v":310263.0191513903}]
[27,"2009-10-01",{"$f":"IF(A37>$C$3,\"_\",IFERROR(VLOOKUP(B37,BAZA_LIBOR_WIBOR_KURS!$C$2:$F$145,2,FALSE),C36))","v":2.7299999999999998E-3},0.02,239.74914204114214,271.9879435202173,{"$f":"IF(A37>$C$3,\"_\",$C$8-SUM($F$11:F37))","v":126300.37037120508},{"$f":"IF(A37>$C$3,\"_\",IFERROR(VLOOKUP(B37,BAZA_LIBOR_WIBOR_KURS!$C$2:$F$145,4,FALSE),H36))","v":2.7826454545454542},{"$f":"IF(A37>$C$3,\"_\",IFERROR(VLOOKUP(B37,BAZA_LIBOR_WIBOR_KURS!$C$2:$F$145,3,FALSE),I36))","v":4.1836363636363609E-2},0.02,1423.982875059655,1598.79,-174.80712494034492,{"$f":"IF(A37>$C$3,\"_\",$C$2-SUM($M$11:M37))","v":310437.82627633063}]
[28,"2009-11-01",{"$f":"IF(A38>$C$3,\"_\",IFERROR(VLOOKUP(B38,BAZA_LIBOR_WIBOR_KURS!$C$2:$F$145,2,FALSE),C37))","v":2.5500000000000002E-3},0.02,237.3394459892229,273.25201525212094,{"$f":"IF(A38>$C$3,\"_\",$C$8-SUM($F$11:F38))","v":126027.11835595296},{"$f":"IF(A38>$C$3,\"_\",IFERROR(VLOOKUP(B38,BAZA_LIBOR_WIBOR_KURS!$C$2:$F$145,4,FALSE),H37))","v":2.7600199999999999},{"$f":"IF(A38>$C$3,\"_\",IFERROR(VLOOKUP(B38,BAZA_LIBOR_WIBOR_KURS!$C$2:$F$145,3,FALSE),I37))","v":4.1915000000000022E-2},0.02,1409.2426448553338,1601.73,-192.48735514466625,{"$f":"IF(A38>$C$3,\"_\",$C$2-SUM($M$11:M38))","v":310630.31363147526}]
[29,"2009-12-01",{"$f":"IF(A39>$C$3,\"_\",IFERROR(VLOOKUP(B39,BAZA_LIBOR_WIBOR_KURS!$C$2:$F$145,2,FALSE),C38))","v":2.5200000000000001E-3},0.02,236.51089211467175,273.89028485986768,{"$f":"IF(A39>$C$3,\"_\",$C$8-SUM($F$11:F39))","v":125753.22807109309},{"$f":"IF(A39>$C$3,\"_\",IFERROR(VLOOKUP(B39,BAZA_LIBOR_WIBOR_KURS!$C$2:$F$145,4,FALSE),H38))","v":2.7561636363636364},{"$f":"IF(A39>$C$3,\"_\",IFERROR(VLOOKUP(B39,BAZA_LIBOR_WIBOR_KURS!$C$2:$F$145,3,FALSE),I38))","v":4.2322727272727262E-2},0.02,1406.7491639344266,1613.28,-206.53083606557334,{"$f":"IF(A39>$C$3,\"_\",$C$2-SUM($M$11:M39))","v":310836.84446754085}]
[30,"2010-01-01",{"$f":"IF(A40>$C$3,\"_\",IFERROR(VLOOKUP(B40,BAZA_LIBOR_WIBOR_KURS!$C$2:$F$145,2,FALSE),C39))","v":2.5000000000000001E-3},0.02,235.78730263329956,274.48737904825032,{"$f":"IF(A40>$C$3,\"_\",$C$8-SUM($F$11:F40))","v":125478.74069204484},{"$f":"IF(A40>$C$3,\"_\",IFERROR(VLOOKUP(B40,BAZA_LIBOR_WIBOR_KURS!$C$2:$F$145,4,FALSE),H39))","v":2.7545149999999996},{"$f":"IF(A40>$C$3,\"_\",IFERROR(VLOOKUP(B40,BAZA_LIBOR_WIBOR_KURS!$C$2:$F$145,3,FALSE),I39))","v":4.2370000000000005E-2},0.02,1405.5592648120542,1615.57,-210.01073518794578,{"$f":"IF(A40>$C$3,\"_\",$C$2-SUM($M$11:M40))","v":311046.85520272882}]
{"$rows_left_out":451}
{"sheet":"BAZA_LIBOR_WIBOR_KURS","index":1,"n_rows":145,"n_cols":10,"rows_kept":145,"cut":false,"hidden":false,"merged":[]}
["Rok","miesiąc","Data","LIBOR_3M_CHF","WIBOR_3M","Kurs PLN/CHF"]
[2005,1,{"$f":"DATE(A2,B2,1)","v":"2005-01-01"},7.3899999999999999E-3,6.6314285714285728E-2,2.638757142857143,null,2005,"styczeń",1]
[2005,2,"2005-02-01",7.5199999999999998E-3,6.5409999999999982E-2,2.5710299999999995,null,2006,"luty",2]
[2005,3,"2005-03-01",7.5399999999999998E-3,6.1545454545454542E-2,2.5933227272727275,null,2007,"marzec",3]
[2005,4,"2005-04-01",7.6499999999999997E-3,5.7764999999999997E-2,2.6861350000000002,null,2008,"kwiecień",4]
[2005,5,"2005-05-01",7.5500000000000003E-3,5.4815000000000003E-2,2.7052749999999999,null,2009,"maj",5]
[2005,6,"2005-06-01",7.4900000000000001E-3,5.2181818181818176E-2,2.6393318181818177,null,2010,"czerwiec",6]
[2005,7,"2005-07-01",7.4900000000000001E-3,4.6809523809523801E-2,2.6309952380952386,null,2011,"lipiec",7]
[2005,8,"2005-08-01",7.5900000000000004E-3,4.674090909090909E-2,2.6043636363636371,null,2012,"sierpień",8]
[2005,9,"2005-09-01",7.62E-3,4.513181818181819E-2,2.5313181818181816,null,2013,"wrzesień",9]
[2005,10,"2005-10-01",8.1200000000000005E-3,4.5452380952380959E-2,2.5312000000000001,null,2014,"październik",10]
[2005,11,"2005-11-01",9.5300000000000003E-3,4.6384999999999996E-2,2.5672600000000001,null,2015,"listopad",11]
[2005,12,"2005-12-01",1.023E-2,4.6166666666666682E-2,2.4891857142857146,null,2016,"grudzień",12]
[2006,1,"2006-01-01",1.008E-2,4.4863636363636369E-2,2.4668818181818177]
[2006,2,"2006-02-01",1.089E-2,4.2615E-2,2.4356049999999998]
[2006,3,"2006-03-01",1.2109999999999999E-2,4.1213043478260866E-2,2.4734347826086958]
[2006,4,"2006-04-01",1.281E-2,4.1400000000000006E-2,2.4884578947368419]
[2006,5,"2006-05-01",1.406E-2,4.1538095238095228E-2,2.5053666666666667]
[2006,6,"2006-06-01",1.481E-2,4.1747619047619047E-2,2.5767523809523816]
[2006,7,"2006-07-01",1.5299999999999999E-2,4.1933333333333322E-2,2.5478952380952373]
[2006,8,"2006-08-01",1.6109999999999999E-2,4.1940909090909112E-2,2.4753272727272728]
[2006,9,"2006-09-01",1.737E-2,4.2090476190476199E-2,2.5061285714285715]
[2006,10,"2006-10-01",1.8450000000000001E-2,4.2168181818181834E-2,2.45505]
[2006,11,"2006-11-01",1.9009999999999999E-2,4.197142857142859E-2,2.4017999999999993]
[2006,12,"2006-12-01",2.017E-2,4.1994736842105272E-2,2.3869684210526319]
[2007,1,"2007-01-01",2.1489999999999999E-2,4.1972727272727287E-2,2.4003272727272726]
[2007,2,"2007-02-01",2.2120000000000001E-2,4.198000000000001E-2,2.402145]
[2007,3,"2007-03-01",2.2589999999999999E-2,4.2172727272727271E-2,2.410077272727273]
[2007,4,"2007-04-01",2.3189999999999999E-2,4.3164999999999995E-2,2.3317600000000001]
[2007,5,"2007-05-01",2.4109999999999999E-2,4.4390476190476189E-2,2.2918761904761906]
[2007,6,"2007-06-01",2.546E-2,4.5150000000000003E-2,2.300335]
[2007,7,"2007-07-01",2.716E-2,4.7804545454545461E-2,2.2740318181818187]
[2007,8,"2007-08-01",2.7959999999999999E-2,4.9086363636363629E-2,2.3273727272727274]
[2007,9,{"$f":"DATE(A34,B34,1)","v":"2007-09-01"},2.8240000000000001E-2,5.0909999999999997E-2,2.2997249999999996]
[2007,10,"2007-10-01",2.7869999999999999E-2,5.128695652173914E-2,2.2189869565217393]
[2007,11,"2007-11-01",2.751E-2,5.3638095238095228E-2,2.2200523809523811]
[2007,12,"2007-12-01",2.7740000000000001E-2,5.666842105263159E-2,2.1712894736842108]
[2008,1,"2008-01-01",2.6960000000000001E-2,5.6427272727272722E-2,2.2278000000000002]
[2008,2,"2008-02-01",2.7449999999999999E-2,5.7428571428571419E-2,2.224019047619048]
[2008,3,"2008-03-01",2.8289999999999999E-2,6.0264999999999999E-2,2.2520199999999999]
{"$rows_left_out":105}